{"text_format":"1","workbook":"xlsx","n_sheets":6,"sheets":["Calendrier","Conges","Extraction","Sources","Jour_feries","Disponibilités"],"not_rendered":{"charts":0,"images":1,"macros":1,"external_links":2,"defined_names":7,"comments":0,"pivot_tables":0},"unopened":[],"bounds":{"document_bytes":16777216,"sheet_cells":100000,"rows_first":2000,"rows_last":500,"rows_between":2000,"halvings":0,"cell_chars":16384,"cell_head_chars":4096},"cells_cut":0,"cells_raw":0,"read":"whole","date_system":"1900"}

{"sheet":"Calendrier","index":0,"n_rows":38,"n_cols":69,"rows_kept":38,"cut":false,"hidden":false,"merged":[[30,1,30,7],[30,16,30,22],[30,31,30,37],[30,46,30,52],[19,55,19,56],[4,1,4,7],[4,16,4,22],[4,31,4,37],[4,46,4,52],[17,1,17,7],[17,16,17,22],[6,55,6,56],[9,55,9,56],[17,31,17,37],[17,46,17,52],[7,55,7,56],[10,55,10,56]]}
[null,1,1,1,1,1,1,1,null,null,null,null,null,null,null,null,2,2,2,2,2,2,2,null,null,null,null,null,null,null,null,3,3,3,3,3,3,3,null,null,null,null,null,null,null,null,4,4,4,4,4,4,4,null,null,null,null,null,null,null,null,null,null,null,null,null,"Pâques"]
[null,{"$f":"WEEKDAY(DATE($BD$8,B1,1),2)","v":3},{"$f":"WEEKDAY(DATE($BD$8,C1,1),2)","v":3},3,3,3,3,3,null,null,null,null,null,null,null,null,{"$f":"WEEKDAY(DATE($BD$8,Q1,1),2)","v":6},{"$f":"WEEKDAY(DATE($BD$8,R1,1),2)","v":6},{"$f":"WEEKDAY(DATE($BD$8,S1,1),2)","v":6},{"$f":"WEEKDAY(DATE($BD$8,T1,1),2)","v":6},{"$f":"WEEKDAY(DATE($BD$8,U1,1),2)","v":6},{"$f":"WEEKDAY(DATE($BD$8,V1,1),2)","v":6},{"$f":"WEEKDAY(DATE($BD$8,W1,1),2)","v":6},null,null,null,null,null,null,null,null,{"$f":"WEEKDAY(DATE($BD$8,AF1,1),2)","v":7},{"$f":"WEEKDAY(DATE($BD$8,AG1,1),2)","v":7},{"$f":"WEEKDAY(DATE($BD$8,AH1,1),2)","v":7},{"$f":"WEEKDAY(DATE($BD$8,AI1,1),2)","v":7},{"$f":"WEEKDAY(DATE($BD$8,AJ1,1),2)","v":7},{"$f":"WEEKDAY(DATE($BD$8,AK1,1),2)","v":7},{"$f":"WEEKDAY(DATE($BD$8,AL1,1),2)","v":7},null,null,null,null,null,null,null,null,{"$f":"WEEKDAY(DATE($BD$8,AU1,1),2)","v":3},{"$f":"WEEKDAY(DATE($BD$8,AV1,1),2)","v":3},{"$f":"WEEKDAY(DATE($BD$8,AW1,1),2)","v":3},{"$f":"WEEKDAY(DATE($BD$8,AX1,1),2)","v":3},{"$f":"WEEKDAY(DATE($BD$8,AY1,1),2)","v":3},{"$f":"WEEKDAY(DATE($BD$8,AZ1,1),2)","v":3},{"$f":"WEEKDAY(DATE($BD$8,BA1,1),2)","v":3},null,null,null,null,null,null,null,null,null,null,null,null,null,{"$f":"ROUND(DATE(AE1,4,MOD(234-11*MOD(AE1,19),30))/7,0)*7-6","v":"1900-04-15"},null,"Accueil"]
[null,1,2,3,4,5,6,7,null,null,null,null,null,null,null,null,1,2,3,4,5,6,7,null,null,null,null,null,null,null,null,1,2,3,4,5,6,7,null,null,null,null,null,null,null,null,1,2,3,4,5,6,7]
[]
[null,{"$f":"UPPER(TEXT(DATE($BD$8,B1,1),\"mmmm aaaa\"))","v":"JANVIER 2020"},null,null,null,null,null,null,null,null,null,null,null,null,null,null,{"$f":"UPPER(TEXT(DATE($BD$8,Q1,1),\"mmmm aaaa\"))","v":"FÉVRIER 2020"},null,null,null,null,null,null,null,null,null,null,null,null,null,null,{"$f":"UPPER(TEXT(DATE($BD$8,AF1,1),\"mmmm aaaa\"))","v":"MARS 2020"},null,null,null,null,null,null,null,null,null,null,null,null,null,null,{"$f":"UPPER(TEXT(DATE($BD$8,AU1,1),\"mmmm aaaa\"))","v":"AVRIL 2020"}]
[null,"L","M","M","J","V","S","D",null,null,null,null,null,null,null,null,"L","M","M","J","V","S","D",null,null,null,null,null,null,null,null,"L","M","M","J","V","S","D",null,null,null,null,null,null,null,null,"L","M","M","J","V","S","D",null,null,null,null,null,null,null,null,null,null,null,null,null,"Jours fériés"]
[null,{"$f":"IFERROR(IF(AND(A7=\"\",B3=B2,ISNUMBER(H6)=FALSE,ISNUMBER(B6)=FALSE,B6<>\"\"),DATE($BD$8,B1,1),IF(AND(A7<>\"\",MONTH(A7+1)=MONTH(A7)),A7+1,IF(AND(H6<>\"\",MONTH(H6+1)=MONTH(H6)),H6+1,\"\"))),\"\")","v":""},{"$f":"IFERROR(IF(AND(B7=\"\",C3=C2,ISNUMBER(I6)=FALSE,ISNUMBER(C6)=FALSE,C6<>\"\"),DATE($BD$8,C1,1),IF(AND(B7<>\"\",MONTH(B7+1)=MONTH(B7)),B7+1,IF(AND(I6<>\"\",MONTH(I6+1)=MONTH(I6)),I6+1,\"\"))),\"\")","v":""},"2020-01-01","2020-01-02","2020-01-03","2020-01-04","2020-01-05",null,null,null,null,null,null,null,null,{"$f":"IFERROR(IF(AND(P7=\"\",Q3=Q2,ISNUMBER(W6)=FALSE,ISNUMBER(Q6)=FALSE,Q6<>\"\"),DATE($BD$8,Q1,1),IF(AND(P7<>\"\",MONTH(P7+1)=MONTH(P7)),P7+1,IF(AND(W6<>\"\",MONTH(W6+1)=MONTH(W6)),W6+1,\"\"))),\"\")","v":""},{"$f":"IFERROR(IF(AND(Q7=\"\",R3=R2,ISNUMBER(X6)=FALSE,ISNUMBER(R6)=FALSE,R6<>\"\"),DATE($BD$8,R1,1),IF(AND(Q7<>\"\",MONTH(Q7+1)=MONTH(Q7)),Q7+1,IF(AND(X6<>\"\",MONTH(X6+1)=MONTH(X6)),X6+1,\"\"))),\"\")","v":""},"","","","2020-02-01","2020-02-02",null,null,null,null,null,null,null,null,{"$f":"IFERROR(IF(AND(AE7=\"\",AF3=AF2,ISNUMBER(AL6)=FALSE,ISNUMBER(AF6)=FALSE,AF6<>\"\"),DATE($BD$8,AF1,1),IF(AND(AE7<>\"\",MONTH(AE7+1)=MONTH(AE7)),AE7+1,IF(AND(AL6<>\"\",MONTH(AL6+1)=MONTH(AL6)),AL6+1,\"\"))),\"\")","v":""},{"$f":"IFERROR(IF(AND(AF7=\"\",AG3=AG2,ISNUMBER(AM6)=FALSE,ISNUMBER(AG6)=FALSE,AG6<>\"\"),DATE($BD$8,AG1,1),IF(AND(AF7<>\"\",MONTH(AF7+1)=MONTH(AF7)),AF7+1,IF(AND(AM6<>\"\",MONTH(AM6+1)=MONTH(AM6)),AM6+1,\"\"))),\"\")","v":""},{"$f":"IFERROR(IF(AND(AG7=\"\",AH3=AH2,ISNUMBER(AN6)=FALSE,ISNUMBER(AH6)=FALSE,AH6<>\"\"),DATE($BD$8,AH1,1),IF(AND(AG7<>\"\",MONTH(AG7+1)=MONTH(AG7)),AG7+1,IF(AND(AN6<>\"\",MONTH(AN6+1)=MONTH(AN6)),AN6+1,\"\"))),\"\")","v":""},{"$f":"IFERROR(IF(AND(AH7=\"\",AI3=AI2,ISNUMBER(AO6)=FALSE,ISNUMBER(AI6)=FALSE,AI6<>\"\"),DATE($BD$8,AI1,1),IF(AND(AH7<>\"\",MONTH(AH7+1)=MONTH(AH7)),AH7+1,IF(AND(AO6<>\"\",MONTH(AO6+1)=MONTH(AO6)),AO6+1,\"\"))),\"\")","v":""},{"$f":"IFERROR(IF(AND(AI7=\"\",AJ3=AJ2,ISNUMBER(AP6)=FALSE,ISNUMBER(AJ6)=FALSE,AJ6<>\"\"),DATE($BD$8,AJ1,1),IF(AND(AI7<>\"\",MONTH(AI7+1)=MONTH(AI7)),AI7+1,IF(AND(AP6<>\"\",MONTH(AP6+1)=MONTH(AP6)),AP6+1,\"\"))),\"\")","v":""},{"$f":"IFERROR(IF(AND(AJ7=\"\",AK3=AK2,ISNUMBER(AQ6)=FALSE,ISNUMBER(AK6)=FALSE,AK6<>\"\"),DATE($BD$8,AK1,1),IF(AND(AJ7<>\"\",MONTH(AJ7+1)=MONTH(AJ7)),AJ7+1,IF(AND(AQ6<>\"\",MONTH(AQ6+1)=MONTH(AQ6)),AQ6+1,\"\"))),\"\")","v":""},{"$f":"IFERROR(IF(AND(AK7=\"\",AL3=AL2,ISNUMBER(AR6)=FALSE,ISNUMBER(AL6)=FALSE,AL6<>\"\"),DATE($BD$8,AL1,1),IF(AND(AK7<>\"\",MONTH(AK7+1)=MONTH(AK7)),AK7+1,IF(AND(AR6<>\"\",MONTH(AR6+1)=MONTH(AR6)),AR6+1,\"\"))),\"\")","v":"2020-03-01"},null,null,null,null,null,null,null,null,{"$f":"IFERROR(IF(AND(AT7=\"\",AU3=AU2,ISNUMBER(BA6)=FALSE,ISNUMBER(AU6)=FALSE,AU6<>\"\"),DATE($BD$8,AU1,1),IF(AND(AT7<>\"\",MONTH(AT7+1)=MONTH(AT7)),AT7+1,IF(AND(BA6<>\"\",MONTH(BA6+1)=MONTH(BA6)),BA6+1,\"\"))),\"\")","v":""},{"$f":"IFERROR(IF(AND(AU7=\"\",AV3=AV2,ISNUMBER(BB6)=FALSE,ISNUMBER(AV6)=FALSE,AV6<>\"\"),DATE($BD$8,AV1,1),IF(AND(AU7<>\"\",MONTH(AU7+1)=MONTH(AU7)),AU7+1,IF(AND(BB6<>\"\",MONTH(BB6+1)=MONTH(BB6)),BB6+1,\"\"))),\"\")","v":""},{"$f":"IFERROR(IF(AND(AV7=\"\",AW3=AW2,ISNUMBER(BC6)=FALSE,ISNUMBER(AW6)=FALSE,AW6<>\"\"),DATE($BD$8,AW1,1),IF(AND(AV7<>\"\",MONTH(AV7+1)=MONTH(AV7)),AV7+1,IF(AND(BC6<>\"\",MONTH(BC6+1)=MONTH(BC6)),BC6+1,\"\"))),\"\")","v":"2020-04-01"},{"$f":"IFERROR(IF(AND(AW7=\"\",AX3=AX2,ISNUMBER(BD6)=FALSE,ISNUMBER(AX6)=FALSE,AX6<>\"\"),DATE($BD$8,AX1,1),IF(AND(AW7<>\"\",MONTH(AW7+1)=MONTH(AW7)),AW7+1,IF(AND(BD6<>\"\",MONTH(BD6+1)=MONTH(BD6)),BD6+1,\"\"))),\"\")","v":"2020-04-02"},{"$f":"IFERROR(IF(AND(AX7=\"\",AY3=AY2,ISNUMBER(BE6)=FALSE,ISNUMBER(AY6)=FALSE,AY6<>\"\"),DATE($BD$8,AY1,1),IF(AND(AX7<>\"\",MONTH(AX7+1)=MONTH(AX7)),AX7+1,IF(AND(BE6<>\"\",MONTH(BE6+1)=MONTH(BE6)),BE6+1,\"\"))),\"\")","v":"2020-04-03"},{"$f":"IFERROR(IF(AND(AY7=\"\",AZ3=AZ2,ISNUMBER(BF6)=FALSE,ISNUMBER(AZ6)=FALSE,AZ6<>\"\"),DATE($BD$8,AZ1,1),IF(AND(AY7<>\"\",MONTH(AY7+1)=MONTH(AY7)),AY7+1,IF(AND(BF6<>\"\",MONTH(BF6+1)=MONTH(BF6)),BF6+1,\"\"))),\"\")","v":"2020-04-04"},{"$f":"IFERROR(IF(AND(AZ7=\"\",BA3=BA2,ISNUMBER(BG6)=FALSE,ISNUMBER(BA6)=FALSE,BA6<>\"\"),DATE($BD$8,BA1,1),IF(AND(AZ7<>\"\",MONTH(AZ7+1)=MONTH(AZ7)),AZ7+1,IF(AND(BG6<>\"\",MONTH(BG6+1)=MONTH(BG6)),BG6+1,\"\"))),\"\")","v":"2020-04-05"},null,null,"Année",null,null,null,null,null,null,null,null,null,null,{"$f":"DATE(AE1,1,1)","v":"1900-01-01"}]
[null,{"$f":"IFERROR(IF(AND(A8=\"\",B4=B3,ISNUMBER(H7)=FALSE,ISNUMBER(B7)=FALSE,B7<>\"\"),DATE($BD$8,B2,1),IF(AND(A8<>\"\",MONTH(A8+1)=MONTH(A8)),A8+1,IF(AND(H7<>\"\",MONTH(H7+1)=MONTH(H7)),H7+1,\"\"))),\"\")","v":"2020-01-06"},{"$f":"IFERROR(IF(AND(B8=\"\",C4=C3,ISNUMBER(I7)=FALSE,ISNUMBER(C7)=FALSE,C7<>\"\"),DATE($BD$8,C2,1),IF(AND(B8<>\"\",MONTH(B8+1)=MONTH(B8)),B8+1,IF(AND(I7<>\"\",MONTH(I7+1)=MONTH(I7)),I7+1,\"\"))),\"\")","v":"2020-01-07"},{"$f":"IFERROR(IF(AND(C8=\"\",D4=D3,ISNUMBER(J7)=FALSE,ISNUMBER(D7)=FALSE,D7<>\"\"),DATE($BD$8,D2,1),IF(AND(C8<>\"\",MONTH(C8+1)=MONTH(C8)),C8+1,IF(AND(J7<>\"\",MONTH(J7+1)=MONTH(J7)),J7+1,\"\"))),\"\")","v":"2020-01-08"},{"$f":"IFERROR(IF(AND(D8=\"\",E4=E3,ISNUMBER(K7)=FALSE,ISNUMBER(E7)=FALSE,E7<>\"\"),DATE($BD$8,E2,1),IF(AND(D8<>\"\",MONTH(D8+1)=MONTH(D8)),D8+1,IF(AND(K7<>\"\",MONTH(K7+1)=MONTH(K7)),K7+1,\"\"))),\"\")","v":"2020-01-09"},{"$f":"IFERROR(IF(AND(E8=\"\",F4=F3,ISNUMBER(L7)=FALSE,ISNUMBER(F7)=FALSE,F7<>\"\"),DATE($BD$8,F2,1),IF(AND(E8<>\"\",MONTH(E8+1)=MONTH(E8)),E8+1,IF(AND(L7<>\"\",MONTH(L7+1)=MONTH(L7)),L7+1,\"\"))),\"\")","v":"2020-01-10"},{"$f":"IFERROR(IF(AND(F8=\"\",G4=G3,ISNUMBER(M7)=FALSE,ISNUMBER(G7)=FALSE,G7<>\"\"),DATE($BD$8,G2,1),IF(AND(F8<>\"\",MONTH(F8+1)=MONTH(F8)),F8+1,IF(AND(M7<>\"\",MONTH(M7+1)=MONTH(M7)),M7+1,\"\"))),\"\")","v":"2020-01-11"},{"$f":"IFERROR(IF(AND(G8=\"\",H4=H3,ISNUMBER(N7)=FALSE,ISNUMBER(H7)=FALSE,H7<>\"\"),DATE($BD$8,H2,1),IF(AND(G8<>\"\",MONTH(G8+1)=MONTH(G8)),G8+1,IF(AND(N7<>\"\",MONTH(N7+1)=MONTH(N7)),N7+1,\"\"))),\"\")","v":"2020-01-12"},null,null,null,null,null,null,null,null,{"$f":"IFERROR(IF(AND(P8=\"\",Q4=Q3,ISNUMBER(W7)=FALSE,ISNUMBER(Q7)=FALSE,Q7<>\"\"),DATE($BD$8,Q2,1),IF(AND(P8<>\"\",MONTH(P8+1)=MONTH(P8)),P8+1,IF(AND(W7<>\"\",MONTH(W7+1)=MONTH(W7)),W7+1,\"\"))),\"\")","v":"2020-02-03"},{"$f":"IFERROR(IF(AND(Q8=\"\",R4=R3,ISNUMBER(X7)=FALSE,ISNUMBER(R7)=FALSE,R7<>\"\"),DATE($BD$8,R2,1),IF(AND(Q8<>\"\",MONTH(Q8+1)=MONTH(Q8)),Q8+1,IF(AND(X7<>\"\",MONTH(X7+1)=MONTH(X7)),X7+1,\"\"))),\"\")","v":"2020-02-04"},{"$f":"IFERROR(IF(AND(R8=\"\",S4=S3,ISNUMBER(Y7)=FALSE,ISNUMBER(S7)=FALSE,S7<>\"\"),DATE($BD$8,S2,1),IF(AND(R8<>\"\",MONTH(R8+1)=MONTH(R8)),R8+1,IF(AND(Y7<>\"\",MONTH(Y7+1)=MONTH(Y7)),Y7+1,\"\"))),\"\")","v":"2020-02-05"},{"$f":"IFERROR(IF(AND(S8=\"\",T4=T3,ISNUMBER(Z7)=FALSE,ISNUMBER(T7)=FALSE,T7<>\"\"),DATE($BD$8,T2,1),IF(AND(S8<>\"\",MONTH(S8+1)=MONTH(S8)),S8+1,IF(AND(Z7<>\"\",MONTH(Z7+1)=MONTH(Z7)),Z7+1,\"\"))),\"\")","v":"2020-02-06"},{"$f":"IFERROR(IF(AND(T8=\"\",U4=U3,ISNUMBER(AA7)=FALSE,ISNUMBER(U7)=FALSE,U7<>\"\"),DATE($BD$8,U2,1),IF(AND(T8<>\"\",MONTH(T8+1)=MONTH(T8)),T8+1,IF(AND(AA7<>\"\",MONTH(AA7+1)=MONTH(AA7)),AA7+1,\"\"))),\"\")","v":"2020-02-07"},{"$f":"IFERROR(IF(AND(U8=\"\",V4=V3,ISNUMBER(AB7)=FALSE,ISNUMBER(V7)=FALSE,V7<>\"\"),DATE($BD$8,V2,1),IF(AND(U8<>\"\",MONTH(U8+1)=MONTH(U8)),U8+1,IF(AND(AB7<>\"\",MONTH(AB7+1)=MONTH(AB7)),AB7+1,\"\"))),\"\")","v":"2020-02-08"},{"$f":"IFERROR(IF(AND(V8=\"\",W4=W3,ISNUMBER(AC7)=FALSE,ISNUMBER(W7)=FALSE,W7<>\"\"),DATE($BD$8,W2,1),IF(AND(V8<>\"\",MONTH(V8+1)=MONTH(V8)),V8+1,IF(AND(AC7<>\"\",MONTH(AC7+1)=MONTH(AC7)),AC7+1,\"\"))),\"\")","v":"2020-02-09"},null,null,null,null,null,null,null,null,{"$f":"IFERROR(IF(AND(AE8=\"\",AF4=AF3,ISNUMBER(AL7)=FALSE,ISNUMBER(AF7)=FALSE,AF7<>\"\"),DATE($BD$8,AF2,1),IF(AND(AE8<>\"\",MONTH(AE8+1)=MONTH(AE8)),AE8+1,IF(AND(AL7<>\"\",MONTH(AL7+1)=MONTH(AL7)),AL7+1,\"\"))),\"\")","v":"2020-03-02"},"2020-03-03","2020-03-04","2020-03-05","2020-03-06","2020-03-07","2020-03-08",null,null,null,null,null,null,null,null,{"$f":"IFERROR(IF(AND(AT8=\"\",AU4=AU3,ISNUMBER(BA7)=FALSE,ISNUMBER(AU7)=FALSE,AU7<>\"\"),DATE($BD$8,AU2,1),IF(AND(AT8<>\"\",MONTH(AT8+1)=MONTH(AT8)),AT8+1,IF(AND(BA7<>\"\",MONTH(BA7+1)=MONTH(BA7)),BA7+1,\"\"))),\"\")","v":"2020-04-06"},"2020-04-07","2020-04-08","2020-04-09","2020-04-10","2020-04-11","2020-04-12",null,null,2020,null,null,null,null,null,null,null,null,null,null,{"$f":"DATE(AE1,5,1)","v":"1900-05-01"}]
[null,"2020-01-13","2020-01-14","2020-01-15","2020-01-16","2020-01-17","2020-01-18","2020-01-19",null,null,null,null,null,null,null,null,"2020-02-10","2020-02-11","2020-02-12","2020-02-13","2020-02-14","2020-02-15","2020-02-16",null,null,null,null,null,null,null,null,"2020-03-09","2020-03-10","2020-03-11","2020-03-12","2020-03-13","2020-03-14","2020-03-15",null,null,null,null,null,null,null,null,"2020-04-13","2020-04-14","2020-04-15","2020-04-16","2020-04-17","2020-04-18","2020-04-19",null,null,null,null,null,null,null,null,null,null,null,null,null,{"$f":"DATE(AE1,5,8)","v":"1900-05-08"}]
[null,"2020-01-20","2020-01-21","2020-01-22","2020-01-23","2020-01-24","2020-01-25","2020-01-26",null,null,null,null,null,null,null,null,"2020-02-17","2020-02-18","2020-02-19","2020-02-20","2020-02-21","2020-02-22","2020-02-23",null,null,null,null,null,null,null,null,"2020-03-16","2020-03-17","2020-03-18","2020-03-19","2020-03-20","2020-03-21","2020-03-22",null,null,null,null,null,null,null,null,"2020-04-20","2020-04-21","2020-04-22","2020-04-23","2020-04-24","2020-04-25","2020-04-26",null,null,"Salarié",null,null,null,null,null,null,null,null,null,null,{"$f":"DATE(AE1,7,14)","v":"1900-07-14"}]
[null,"2020-01-27","2020-01-28","2020-01-29","2020-01-30","2020-01-31","","",null,null,null,null,null,null,null,null,"2020-02-24","2020-02-25","2020-02-26","2020-02-27","2020-02-28","2020-02-29","",null,null,null,null,null,null,null,null,"2020-03-23","2020-03-24","2020-03-25","2020-03-26","2020-03-27","2020-03-28","2020-03-29",null,null,null,null,null,null,null,null,"2020-04-27","2020-04-28","2020-04-29","2020-04-30","","","",null,null,"Fortune Alain",null,null,null,null,null,null,null,null,null,null,{"$f":"DATE(AE1,8,15)","v":"1900-08-15"}]
[null,"","","","","","","",null,null,null,null,null,null,null,null,"","","","","","","",null,null,null,null,null,null,null,null,"2020-03-30","2020-03-31","","","","","",null,null,null,null,null,null,null,null,"","","","","","","",null,null,null,null,null,null,null,null,null,null,null,null,null,{"$f":"DATE(AE1,11,1)","v":"1900-11-01"}]
[null,null,null,null,null,null,null,null,null,null,null,null,null,null,null,null,null,null,null,null,null,null,null,null,null,null,null,null,null,null,null,null,null,null,null,null,null,null,null,null,null,null,null,null,null,null,null,null,null,null,null,null,null,null,null,null,null,null,null,null,null,null,null,null,null,null,{"$f":"DATE(AE1,11,11)","v":"1900-11-11"}]
[null,5,5,5,5,5,5,5,null,null,null,null,null,null,null,null,6,6,6,6,6,6,6,null,null,null,null,null,null,null,null,7,7,7,7,7,7,7,null,null,null,null,null,null,null,null,8,8,8,8,8,8,8]
[null,{"$f":"WEEKDAY(DATE($BD$8,B14,1),2)","v":5},{"$f":"WEEKDAY(DATE($BD$8,C14,1),2)","v":5},{"$f":"WEEKDAY(DATE($BD$8,D14,1),2)","v":5},{"$f":"WEEKDAY(DATE($BD$8,E14,1),2)","v":5},{"$f":"WEEKDAY(DATE($BD$8,F14,1),2)","v":5},{"$f":"WEEKDAY(DATE($BD$8,G14,1),2)","v":5},{"$f":"WEEKDAY(DATE($BD$8,H14,1),2)","v":5},null,null,null,null,null,null,null,null,{"$f":"WEEKDAY(DATE($BD$8,Q14,1),2)","v":1},{"$f":"WEEKDAY(DATE($BD$8,R14,1),2)","v":1},{"$f":"WEEKDAY(DATE($BD$8,S14,1),2)","v":1},{"$f":"WEEKDAY(DATE($BD$8,T14,1),2)","v":1},{"$f":"WEEKDAY(DATE($BD$8,U14,1),2)","v":1},{"$f":"WEEKDAY(DATE($BD$8,V14,1),2)","v":1},{"$f":"WEEKDAY(DATE($BD$8,W14,1),2)","v":1},null,null,null,null,null,null,null,null,{"$f":"WEEKDAY(DATE($BD$8,AF14,1),2)","v":3},{"$f":"WEEKDAY(DATE($BD$8,AG14,1),2)","v":3},{"$f":"WEEKDAY(DATE($BD$8,AH14,1),2)","v":3},{"$f":"WEEKDAY(DATE($BD$8,AI14,1),2)","v":3},{"$f":"WEEKDAY(DATE($BD$8,AJ14,1),2)","v":3},{"$f":"WEEKDAY(DATE($BD$8,AK14,1),2)","v":3},{"$f":"WEEKDAY(DATE($BD$8,AL14,1),2)","v":3},null,null,null,null,null,null,null,null,{"$f":"WEEKDAY(DATE($BD$8,AU14,1),2)","v":6},{"$f":"WEEKDAY(DATE($BD$8,AV14,1),2)","v":6},{"$f":"WEEKDAY(DATE($BD$8,AW14,1),2)","v":6},{"$f":"WEEKDAY(DATE($BD$8,AX14,1),2)","v":6},{"$f":"WEEKDAY(DATE($BD$8,AY14,1),2)","v":6},{"$f":"WEEKDAY(DATE($BD$8,AZ14,1),2)","v":6},{"$f":"WEEKDAY(DATE($BD$8,BA14,1),2)","v":6}]
{"$rows_left_out":24}
{"sheet":"Conges","index":1,"n_rows":1489,"n_cols":18,"rows_kept":1489,"cut":false,"hidden":false,"merged":[]}
[]
[null,"Nom","Date","Cause"]
[null,"Hamalibou Arlette","2020-02-10","CP",{"$f":"IF(AND(YEAR(C3)=Calendrier!$BD$8,B3=Calendrier!$BD$11),MAX($E$2:E2)+1,\"\")","v":""},null,null,null,null,null,null,null,null,null,null,null,null,"Braltar"]
[null,"Hamalibou Arlette","2020-02-11","CP",{"$f":"IF(AND(YEAR(C4)=Calendrier!$BD$8,B4=Calendrier!$BD$11),MAX($E$2:E3)+1,\"\")","v":""},null,null,null,null,null,null,null,null,null,null,null,null,"Céhef"]
[null,"Hamalibou Arlette","2020-02-12","CP",{"$f":"IF(AND(YEAR(C5)=Calendrier!$BD$8,B5=Calendrier!$BD$11),MAX($E$2:E4)+1,\"\")","v":""},null,null,null,null,null,null,null,null,null,null,null,null,"Galls"]
[null,"Hamalibou Arlette","2020-02-13","CP",{"$f":"IF(AND(YEAR(C6)=Calendrier!$BD$8,B6=Calendrier!$BD$11),MAX($E$2:E5)+1,\"\")","v":""},null,null,null,null,null,null,null,null,null,null,null,null,"Hamalibou"]
[null,"Hamalibou Arlette","2020-02-14","CP",{"$f":"IF(AND(YEAR(C7)=Calendrier!$BD$8,B7=Calendrier!$BD$11),MAX($E$2:E6)+1,\"\")","v":""},null,null,null,null,null,null,null,null,null,null,null,null,"Héresse"]
[null,"Hamalibou Arlette","2020-05-04","RTT",{"$f":"IF(AND(YEAR(C8)=Calendrier!$BD$8,B8=Calendrier!$BD$11),MAX($E$2:E7)+1,\"\")","v":""},null,null,null,null,null,null,null,null,null,null,null,null,"Niomme"]
[null,"Hamalibou Arlette","2020-05-05","RTT",{"$f":"IF(AND(YEAR(C9)=Calendrier!$BD$8,B9=Calendrier!$BD$11),MAX($E$2:E8)+1,\"\")","v":""}]
[null,"Hamalibou Arlette","2020-05-06","RTT",{"$f":"IF(AND(YEAR(C10)=Calendrier!$BD$8,B10=Calendrier!$BD$11),MAX($E$2:E9)+1,\"\")","v":""}]
[null,"Hamalibou Arlette","2020-05-07","RTT",{"$f":"IF(AND(YEAR(C11)=Calendrier!$BD$8,B11=Calendrier!$BD$11),MAX($E$2:E10)+1,\"\")","v":""}]
[null,"Hamalibou Arlette","2020-07-06","CP",{"$f":"IF(AND(YEAR(C12)=Calendrier!$BD$8,B12=Calendrier!$BD$11),MAX($E$2:E11)+1,\"\")","v":""}]
[null,"Hamalibou Arlette","2020-07-07","CP",{"$f":"IF(AND(YEAR(C13)=Calendrier!$BD$8,B13=Calendrier!$BD$11),MAX($E$2:E12)+1,\"\")","v":""}]
[null,"Hamalibou Arlette","2020-07-08","CP",{"$f":"IF(AND(YEAR(C14)=Calendrier!$BD$8,B14=Calendrier!$BD$11),MAX($E$2:E13)+1,\"\")","v":""}]
[null,"Hamalibou Arlette","2020-07-09","CP",{"$f":"IF(AND(YEAR(C15)=Calendrier!$BD$8,B15=Calendrier!$BD$11),MAX($E$2:E14)+1,\"\")","v":""}]
{"$rows_left_out":1475}
{"sheet":"Extraction","index":2,"n_rows":20,"n_cols":5,"rows_kept":20,"cut":false,"hidden":false,"merged":[]}
[]
[null,"Fortune Alain","2020-07-15","CP","Fortune Alain15-07-2020CP"]
[null,"Fortune Alain","2020-07-16","CP","Fortune Alain16-07-2020CP"]
[null,"Fortune Alain","2020-07-17","CP","Fortune Alain17-07-2020CP"]
[null,"Fortune Alain","2020-07-20","CP","Fortune Alain20-07-2020CP"]
[null,"Fortune Alain","2020-07-21","CP","Fortune Alain21-07-2020CP"]
[null,"Fortune Alain","2020-07-22","CP","Fortune Alain22-07-2020CP"]
[null,"Fortune Alain","2020-07-23","CP","Fortune Alain23-07-2020CP"]
[null,"Fortune Alain","2020-07-24","CP","Fortune Alain24-07-2020CP"]
[null,"Fortune Alain","2020-07-27","CP","Fortune Alain27-07-2020CP"]
[null,"Fortune Alain","2020-07-28","CP","Fortune Alain28-07-2020CP"]
[null,"Fortune Alain","2020-07-29","CP","Fortune Alain29-07-2020CP"]
[null,"Fortune Alain","2020-07-30","CP","Fortune Alain30-07-2020CP"]
[null,"Fortune Alain","2020-07-31","CP","Fortune Alain31-07-2020CP"]
[null,"Fortune Alain","2020-08-24","RTT","Fortune Alain24-08-2020RTT"]
{"$rows_left_out":6}
{"sheet":"Sources","index":3,"n_rows":18,"n_cols":4,"rows_kept":18,"cut":false,"hidden":false,"merged":[]}
[]
[null,"Années",null,"Salariés"]
[null,2019,null,"Bonbeur Jean"]
[null,2020,null,"Braltar Giles"]
[null,2021,null,"Céhef Hassan"]
[null,2022,null,"Dagin Bruno"]
[null,2023,null,"De MontéCarlo Coralie"]
[null,2024,null,"Débois Romain"]
[null,2025,null,"Doeuf John"]
[null,2026,null,"Douche Raël"]
[null,2027,null,"Ecar Medi"]
[null,2028,null,"Feuille Emille"]
[null,2029,null,"Fonfec Sophie"]
[null,2030,null,"Fortune Alain"]
[null,null,null,"Galls Charline"]
{"$rows_left_out":4}
{"sheet":"Jour_feries","index":4,"n_rows":16,"n_cols":10,"rows_kept":16,"cut":false,"hidden":false,"merged":[[1,1,1,7]]}
[]
[null,"Jour fériés en France"]
[]
[null,null,2017,2018,2019,2020,2021,2022]
[null,null,1,2,3,4,5,6]
[null,"Jour de l'an","2017-01-01","2018-01-01","2019-01-01","2020-01-01","2021-01-01","2022-01-01",null,{"$f":"IFERROR(INDEX(C:H,ROW(I6),MATCH(Calendrier!$BD$8,$4:$4,0)-2),\"\")","v":"2020-01-01"}]
[null,"Lundi de Pâques","2017-04-17","2018-04-02","2019-04-22","2020-04-13","2021-04-05","2022-04-18",null,{"$f":"IFERROR(INDEX(C:H,ROW(I7),MATCH(Calendrier!$BD$8,$4:$4,0)-2),\"\")","v":"2020-04-13"}]
[null,"Fête du Travail","2017-05-01","2018-05-01","2019-05-01","2020-05-01","2021-05-01","2022-05-01",null,{"$f":"IFERROR(INDEX(C:H,ROW(I8),MATCH(Calendrier!$BD$8,$4:$4,0)-2),\"\")","v":"2020-05-01"}]
[null,"8 Mai","2017-05-08","2018-05-08","2019-05-08","2020-05-08","2021-05-08","2022-05-08",null,{"$f":"IFERROR(INDEX(C:H,ROW(I9),MATCH(Calendrier!$BD$8,$4:$4,0)-2),\"\")","v":"2020-05-08"}]
[null,"Jeudi de l'Ascension","2017-05-25","2018-05-10","2019-05-30","2020-05-21","2021-05-13","2022-05-26",null,{"$f":"IFERROR(INDEX(C:H,ROW(I10),MATCH(Calendrier!$BD$8,$4:$4,0)-2),\"\")","v":"2020-05-21"}]
[null,"Lundi de Pentecôte","2017-06-05","2018-05-21","2019-06-10","2020-06-01","2021-05-24","2022-06-06",null,{"$f":"IFERROR(INDEX(C:H,ROW(I11),MATCH(Calendrier!$BD$8,$4:$4,0)-2),\"\")","v":"2020-06-01"}]
[null,"Fête Nationale","2017-07-14","2018-07-14","2019-07-14","2020-07-14","2021-07-14","2022-07-14",null,{"$f":"IFERROR(INDEX(C:H,ROW(I12),MATCH(Calendrier!$BD$8,$4:$4,0)-2),\"\")","v":"2020-07-14"}]
[null,"Assomption","2017-08-15","2018-08-15","2019-08-15","2020-08-15","2021-08-15","2022-08-15",null,{"$f":"IFERROR(INDEX(C:H,ROW(I13),MATCH(Calendrier!$BD$8,$4:$4,0)-2),\"\")","v":"2020-08-15"}]
[null,"La Toussaint","2017-11-01","2018-11-01","2019-11-01","2020-11-01","2021-11-01","2022-11-01",null,{"$f":"IFERROR(INDEX(C:H,ROW(I14),MATCH(Calendrier!$BD$8,$4:$4,0)-2),\"\")","v":"2020-11-01"}]
[null,"Armistice","2017-11-11","2018-11-11","2019-11-11","2020-11-11","2021-11-11","2022-11-11",null,{"$f":"IFERROR(INDEX(C:H,ROW(I15),MATCH(Calendrier!$BD$8,$4:$4,0)-2),\"\")","v":"2020-11-11"}]
{"$rows_left_out":2}
{"sheet":"Disponibilités","index":5,"n_rows":4,"n_cols":4,"rows_kept":4,"cut":false,"hidden":false,"merged":[[1,1,1,3]]}
[]
[null,"Disponibilités pour la période"]
[]
[null,"Nom","Fréq. Présence","Dates absence"]