{"text_format":"1","workbook":"xlsx","n_sheets":6,"sheets":["AdresseIndirect","Hamalibou","Galls","Braltar","Feuline","Doeuf"],"not_rendered":{"charts":0,"images":0,"macros":0,"external_links":0,"defined_names":0,"comments":0,"pivot_tables":0},"unopened":[],"bounds":{"document_bytes":16777216,"sheet_cells":100000,"rows_first":2000,"rows_last":500,"rows_between":2000,"halvings":0,"cell_chars":16384,"cell_head_chars":4096},"cells_cut":0,"cells_raw":0,"read":"whole","date_system":"1900"}

{"sheet":"AdresseIndirect","index":0,"n_rows":14,"n_cols":15,"rows_kept":14,"cut":false,"hidden":false,"merged":[[13,6,13,7],[13,1,13,2],[0,1,0,2],[0,5,0,7],[0,3,0,4],[2,4,2,5],[2,2,2,3],[2,7,2,8]]}
[null,"Bonbache.fr",null,"Bonbache.fr/Excel",null,"Bonbache.fr/ExcelVBA",null,null,"Livres Excel",null,null,null,null,null,"Hamalibou"]
[null,null,null,null,null,null,null,null,null,null,null,null,null,null,"Galls"]
[null,"Choix 1","Feuline",null,"<== Comparer ==>",null,"Choix 2","Hamalibou",null,null,null,null,null,null,"Braltar"]
[null,null,null,null,null,null,null,null,null,null,null,null,null,null,"Feuline"]
[null,"Article","QTE","THT",null,null,"Article","QTE","THT",null,null,null,null,null,"Doeuf"]
[null,"Ar001",{"$f":"INDEX(INDIRECT($C$3&\"!D3:D10\"),MATCH(B6,INDIRECT($C$3&\"!B3:B10\"),0))","v":41},{"$f":"INDEX(INDIRECT($C$3&\"!E3:E10\"),MATCH(B6,INDIRECT($C$3&\"!B3:B10\"),0))","v":6150},null,null,"Ar001",{"$f":"INDEX(INDIRECT($H$3&\"!D3:D10\"),MATCH(B6,INDIRECT($H$3&\"!B3:B10\"),0))","v":34},{"$f":"INDEX(INDIRECT($H$3&\"!E3:E10\"),MATCH(B6,INDIRECT($H$3&\"!B3:B10\"),0))","v":5100}]
[null,"Ar002",{"$f":"INDEX(INDIRECT($C$3&\"!D3:D10\"),MATCH(B7,INDIRECT($C$3&\"!B3:B10\"),0))","v":16},{"$f":"INDEX(INDIRECT($C$3&\"!E3:E10\"),MATCH(B7,INDIRECT($C$3&\"!B3:B10\"),0))","v":1920},null,null,"Ar002",{"$f":"INDEX(INDIRECT($H$3&\"!D3:D10\"),MATCH(B7,INDIRECT($H$3&\"!B3:B10\"),0))","v":15},{"$f":"INDEX(INDIRECT($H$3&\"!E3:E10\"),MATCH(B7,INDIRECT($H$3&\"!B3:B10\"),0))","v":1800}]
[null,"Ar003",45,9450,null,null,"Ar003",25,5250]
[null,"Ar004",33,2805,null,null,"Ar004",28,2380]
[null,"Ar005",13,650,null,null,"Ar005",37,1850]
[null,"Ar006",41,7790,null,null,"Ar006",48,9120]
[null,"Ar007",44,4840,null,null,"Ar007",28,3080]
[null,"Ar008",7,2240,null,null,"Ar008",11,3520]
[null,"Total",null,{"$f":"SUM(D6:D13)","v":35845},null,null,"Total",null,{"$f":"SUM(I6:I13)","v":32100}]

{"sheet":"Hamalibou","index":1,"n_rows":10,"n_cols":5,"rows_kept":10,"cut":false,"hidden":false,"merged":[]}
[]
[null,"Article","PUHT","QTE","THT"]
[null,"Ar005",50,37,{"$f":"C3*D3","v":1850}]
[null,"Ar002",120,15,{"$f":"C4*D4","v":1800}]
[null,"Ar008",320,11,3520]
[null,"Ar004",85,28,2380]
[null,"Ar001",150,34,5100]
[null,"Ar006",190,48,9120]
[null,"Ar007",110,28,3080]
[null,"Ar003",210,25,5250]

{"sheet":"Galls","index":2,"n_rows":10,"n_cols":5,"rows_kept":10,"cut":false,"hidden":false,"merged":[]}
[]
[null,"Article","PUHT","QTE","THT"]
[null,"Ar008",320,13,{"$f":"C3*D3","v":4160}]
[null,"Ar002",120,43,{"$f":"C4*D4","v":5160}]
[null,"Ar003",210,33,6930]
[null,"Ar006",190,23,4370]
[null,"Ar005",50,41,2050]
[null,"Ar004",85,28,2380]
[null,"Ar007",110,44,4840]
[null,"Ar001",150,34,5100]

{"sheet":"Braltar","index":3,"n_rows":10,"n_cols":5,"rows_kept":10,"cut":false,"hidden":false,"merged":[]}
[]
[null,"Article","PUHT","QTE","THT"]
[null,"Ar001",150,49,{"$f":"C3*D3","v":7350}]
[null,"Ar002",120,18,{"$f":"C4*D4","v":2160}]
[null,"Ar003",210,14,2940]
[null,"Ar004",85,10,850]
[null,"Ar005",50,40,2000]
[null,"Ar006",190,43,8170]
[null,"Ar007",110,44,4840]
[null,"Ar008",320,9,2880]

{"sheet":"Feuline","index":4,"n_rows":10,"n_cols":5,"rows_kept":10,"cut":false,"hidden":false,"merged":[]}
[]
[null,"Article","PUHT","QTE","THT"]
[null,"Ar002",120,16,{"$f":"C3*D3","v":1920}]
[null,"Ar001",150,41,{"$f":"C4*D4","v":6150}]
[null,"Ar003",210,45,9450]
[null,"Ar005",50,13,650]
[null,"Ar004",85,33,2805]
[null,"Ar006",190,41,7790]
[null,"Ar008",320,7,2240]
[null,"Ar007",110,44,4840]

{"sheet":"Doeuf","index":5,"n_rows":10,"n_cols":5,"rows_kept":10,"cut":false,"hidden":false,"merged":[]}
[]
[null,"Article","PUHT","QTE","THT"]
[null,"Ar003",210,19,{"$f":"C3*D3","v":3990}]
[null,"Ar008",320,17,{"$f":"C4*D4","v":5440}]
[null,"Ar001",150,49,7350]
[null,"Ar004",85,40,3400]
[null,"Ar005",50,49,2450]
[null,"Ar007",110,34,3740]
[null,"Ar006",190,21,3990]
[null,"Ar002",120,32,3840]